{"text_format":"1","workbook":"xlsx","n_sheets":2,"sheets":["Katalogdaten","Technische_Daten"],"not_rendered":{"charts":1,"images":1,"macros":0,"external_links":0,"defined_names":1,"comments":1,"pivot_tables":0},"unopened":[],"bounds":{"document_bytes":16777216,"sheet_cells":100000,"rows_first":2000,"rows_last":500,"rows_between":2000,"halvings":0,"cell_chars":16384,"cell_head_chars":4096},"cells_cut":0,"cells_raw":0,"read":"whole","date_system":"1900"}

{"sheet":"Katalogdaten","index":0,"n_rows":34,"n_cols":13,"rows_kept":34,"cut":false,"hidden":false,"merged":[[24,9,24,14],[3,9,3,14]]}
[]
[]
[]
[null,"Input box LOG nominal value",null,30,60,80,99,null,null,"Values count for chosen LOG version in first column"]
[null,"Description",null,{"$f":"VLOOKUP(D6,Technische_Daten!10:89,8,FALSE)","v":"LOG 30,0-M16x1-M5"},{"$f":"VLOOKUP(E6,Technische_Daten!10:89,8,FALSE)","v":"LOG 60,0-M16x1-M5"},{"$f":"VLOOKUP(F6,Technische_Daten!10:89,8,FALSE)","v":"LOG 80,0-M20x1,5-G1/8"},{"$f":"VLOOKUP(G6,Technische_Daten!10:89,8,FALSE)","v":"LOG 99,0-M20x1,5-G1/8"}]
[null,"Ident.-no.",null,{"$f":"CONCATENATE(\"03989\",D4)","v":"0398930"},{"$f":"CONCATENATE(\"03989\",E4)","v":"0398960"},{"$f":"CONCATENATE(\"03989\",F4)","v":"0398980"},"0398999"]
[null,"Gripper-Ø D +/- 0.1","[mm]",{"$f":"VLOOKUP(D6,Technische_Daten!10:89,4,FALSE)","v":29.7},{"$f":"VLOOKUP(E6,Technische_Daten!10:89,4,FALSE)","v":59.4},{"$f":"VLOOKUP(F6,Technische_Daten!10:89,4,FALSE)","v":79.2},{"$f":"VLOOKUP(G6,Technische_Daten!10:89,4,FALSE)","v":98.01}]
[null,"Height H","[mm]",{"$f":"VLOOKUP(D6,Technische_Daten!10:89,5,FALSE)","v":43.499999999999993},{"$f":"VLOOKUP(E6,Technische_Daten!10:89,5,FALSE)","v":70.499999999999972},{"$f":"VLOOKUP(F6,Technische_Daten!10:89,5,FALSE)","v":93.999999999999943},{"$f":"VLOOKUP(G6,Technische_Daten!10:89,5,FALSE)","v":116.32499999999992}]
[null,"Mounting thread A","[]",{"$f":"VLOOKUP(D6,Technische_Daten!10:89,6,FALSE)","v":"M16x1"},{"$f":"VLOOKUP(E6,Technische_Daten!10:89,6,FALSE)","v":"M16x1"},{"$f":"VLOOKUP(F6,Technische_Daten!10:89,6,FALSE)","v":"M20x1,5"},{"$f":"VLOOKUP(G6,Technische_Daten!10:89,6,FALSE)","v":"M20x1,5"}]
[null,"Air connection thread B","[]",{"$f":"VLOOKUP(D6,Technische_Daten!10:89,7,FALSE)","v":"M5"},{"$f":"VLOOKUP(E6,Technische_Daten!10:89,7,FALSE)","v":"M5"},{"$f":"VLOOKUP(F6,Technische_Daten!10:89,7,FALSE)","v":"G1/8"},{"$f":"VLOOKUP(G6,Technische_Daten!10:89,7,FALSE)","v":"G1/8"}]
[null,"Workpiece-Ø D min *","[mm]",{"$f":"VLOOKUP(D6,Technische_Daten!10:89,20,FALSE)","v":30},{"$f":"VLOOKUP(E6,Technische_Daten!10:89,20,FALSE)","v":60},{"$f":"VLOOKUP(F6,Technische_Daten!10:89,20,FALSE)","v":80},{"$f":"VLOOKUP(G6,Technische_Daten!10:89,20,FALSE)","v":99}]
[null,"Workpiece-Ø D max","[mm]",{"$f":"VLOOKUP(D6,Technische_Daten!10:89,21,FALSE)","v":31.787499999999998},{"$f":"VLOOKUP(E6,Technische_Daten!10:89,21,FALSE)","v":66.128571428571433},{"$f":"VLOOKUP(F6,Technische_Daten!10:89,21,FALSE)","v":88.7},{"$f":"VLOOKUP(G6,Technische_Daten!10:89,21,FALSE)","v":110.7}]
[null,"Opening force Ø D min **","[N]",{"$f":"VLOOKUP(D6,Technische_Daten!10:89,22,FALSE)","v":136.86274509803911},{"$f":"VLOOKUP(E6,Technische_Daten!10:89,22,FALSE)","v":596.6904761904766},{"$f":"VLOOKUP(F6,Technische_Daten!10:89,22,FALSE)","v":972.73333333333267},{"$f":"VLOOKUP(G6,Technische_Daten!10:89,22,FALSE)","v":2516.6666666666679}]
[null,"Opening force Ø D max **","[N]",{"$f":"VLOOKUP(D6,Technische_Daten!10:89,23,FALSE)","v":40},{"$f":"VLOOKUP(E6,Technische_Daten!10:89,23,FALSE)","v":190.47619047619048},{"$f":"VLOOKUP(F6,Technische_Daten!10:89,23,FALSE)","v":433.33333333333337},{"$f":"VLOOKUP(G6,Technische_Daten!10:89,23,FALSE)","v":1166.6666666666667}]
[null,"Weight","[kg]",{"$f":"VLOOKUP(D6,Technische_Daten!10:89,11,FALSE)","v":0.02},{"$f":"VLOOKUP(E6,Technische_Daten!10:89,11,FALSE)","v":0.10842857142857143},{"$f":"VLOOKUP(F6,Technische_Daten!10:89,11,FALSE)","v":0.23799999999999999},{"$f":"VLOOKUP(G6,Technische_Daten!10:89,11,FALSE)","v":0.44}]
[null,"Recommended workpiece weight","[kg]",{"$f":"VLOOKUP(D6,Technische_Daten!10:89,12,FALSE)","v":0.69756750814494961},{"$f":"VLOOKUP(E6,Technische_Daten!10:89,12,FALSE)","v":3.0412358623367819},{"$f":"VLOOKUP(F6,Technische_Daten!10:89,12,FALSE)","v":4.9578661230037344},{"$f":"VLOOKUP(G6,Technische_Daten!10:89,12,FALSE)","v":12.827047230716962}]
[null,"Air consumption per double stroke","[cm3]",{"$f":"VLOOKUP(D6,Technische_Daten!10:89,14,FALSE)","v":8.6},{"$f":"VLOOKUP(E6,Technische_Daten!10:89,14,FALSE)","v":28.823571428571427},{"$f":"VLOOKUP(F6,Technische_Daten!10:89,14,FALSE)","v":65.339699999999993},{"$f":"VLOOKUP(G6,Technische_Daten!10:89,14,FALSE)","v":122.79900000000001}]
[null,"Max. operating pressure **","[bar]",{"$f":"VLOOKUP(D6,Technische_Daten!10:89,15,FALSE)","v":6},{"$f":"VLOOKUP(E6,Technische_Daten!10:89,15,FALSE)","v":6},{"$f":"VLOOKUP(F6,Technische_Daten!10:89,15,FALSE)","v":6},{"$f":"VLOOKUP(G6,Technische_Daten!10:89,15,FALSE)","v":6}]
[null,"Nominal operating pressure","[bar]",{"$f":"VLOOKUP(D6,Technische_Daten!10:89,16,FALSE)","v":6},{"$f":"VLOOKUP(E6,Technische_Daten!10:89,16,FALSE)","v":6},{"$f":"VLOOKUP(F6,Technische_Daten!10:89,16,FALSE)","v":6},{"$f":"VLOOKUP(G6,Technische_Daten!10:89,16,FALSE)","v":6}]
[null,"Closing / opening time","[s]",{"$f":"VLOOKUP(D6,Technische_Daten!10:89,18,FALSE)","v":"0,06/0,06"},{"$f":"VLOOKUP(E6,Technische_Daten!10:89,18,FALSE)","v":"0,14/0,14"},{"$f":"VLOOKUP(F6,Technische_Daten!10:89,18,FALSE)","v":"0,22/0,22"},{"$f":"VLOOKUP(G6,Technische_Daten!10:89,18,FALSE)","v":"0,44/0,44"}]
[null,"Min./max. ambient temperature","[°C]",{"$f":"VLOOKUP(D6,Technische_Daten!10:89,19,FALSE)","v":"-40/80"},{"$f":"VLOOKUP(E6,Technische_Daten!10:89,19,FALSE)","v":"-40/80"},{"$f":"VLOOKUP(F6,Technische_Daten!10:89,19,FALSE)","v":"-40/80"},{"$f":"VLOOKUP(G6,Technische_Daten!10:89,19,FALSE)","v":"-40/80"}]
[null,"Housing material","[]","PA12","PA12","PA12","PA12"]
[null,"IP class ","[]",27,27,27,27]
[]
[null,null,null,null,null,null,null,null,null,"Auslegungshilfe für LOG"]
[null,"* Note reference creep",null,null,null,null,null,null,null,"m",{"$f":"(D14-D13)/(D12-D11)","v":-54.188948306595371},"Steigung"]
[null,"** The gripping force can be set directly by the operating pressure. At a lower pressure than the nominal working pressure the full stroke cannot be achieved .",null,null,null,null,null,null,null,"x",31,"Workpiece-Ø",{"$f":"CONCATENATE(\"permitted values: Ø\",ROUND(D11,2),\" bis Ø\",ROUND(D12,2))","v":"permitted values: Ø30 bis Ø31,79"}]
[null,null,null,null,null,null,null,null,null,"b",{"$f":"D14-K26*D12","v":1762.5311942959001},"Y-Achsenschnitt"]
[null,"The LOG hole gripper may not be actuated with compressed air over time (> 1 hour).  (eg. machine breakdown or overnight).",null,null,null,null,null,null,null,"y",{"$f":"K26*K27+K28","v":82.673796791443692},"calculate opening force at given Ø"]
[null,"In addition, idle strokes should be avoided (Opening of the gripper without workpiece).",null,null,null,null,null,null,null,"µ",0.1,"Input adhesion factor"]
{"$rows_left_out":5}
{"sheet":"Technische_Daten","index":1,"n_rows":187,"n_cols":23,"rows_kept":187,"cut":false,"hidden":true,"merged":[]}
[]
[]
[]
[null,null,null,null,null,null,null,null,null,null,null,"PA2200/Alu (0,15)"]
[null,null,null,null,null,null,null,null,null,null,"ermittelter Reibwert",0.15]
[]
["PIM",null,null,"PIM","PIM","PIM","PIM","PIM",null,null,"PIM","PIM",null,"PIM","PIM","PIM",null,"PIM","PIM","PIM","PIM","PIM","PIM"]
[1,2,3,4,5,6,7,8,9,10,11,12,13,14,15,16,17,18,19,20,21,22,23]
["Ident-\nnummer","NennØ","Art","ØD","H","A","B","Bezeichnung","Eigen-\nmasse\naus Pro/E\n[kg]","Eigen-\nmasse\ngemessen\n[kg]","Eigen-\nmasse\nangegeben\n[kg]","empfohlenes\nWerkstück-\ngewicht berechnet\n[kg]","Fluidverbrauch pro Doppelhub (Volumen Pro/E)\n[cm^3]","Fluidverbrauch pro Doppelhub angegeben\n[cm^3]","max\nBetriebsdruck\n[bar]","Nenn-betriebsdruck\n[bar]","Schließ-/\nÖffnungszeit\ngemessen\n[s]","Schließ-/\nÖffnungszeit\nangegeben\n[s]","min/max\nUmgebungs-\ntemperatur\n[°C]","dmin\n(6 bar)","dmax \nKatalog\nangegeben\n(6 bar)","F(dmin)\nberechnete Greifkraft \n6 bar","F(dmax)\nberechnete Greifkraft\n6 bar"]
["0398920",20,"Schnappscheibe",{"$f":"0.99*B10","v":19.8},29,{"$f":"IF(AND(B10<=25,B10>=20),\"M14x1,5\",IF(B10<=63,\"M16x1\",IF(B10<=99,\"M20x1,5\",\"???\")))","v":"M14x1,5"},"M5",{"$f":"CONCATENATE(\"LOG \",FIXED(Tabelle1[[#This Row],[NennØ]],1),\"-\",Tabelle1[[#This Row],[A]],\"-\",Tabelle1[[#This Row],[B]])","v":"LOG 20,0-M14x1,5-M5"},7.7844468399999997E-3,8.0000000000000002E-3,{"$f":"Tabelle1[[#This Row],[Eigen-\nmasse\ngemessen\n'[kg']]]","v":8.0000000000000002E-3},{"$f":"0.1*Tabelle1[[#This Row],[F(dmin)\nberechnete Greifkraft \n6 bar]]/9.81/2","v":0.54662112365961812},2.35,{"$f":"Tabelle1[[#This Row],[Fluidverbrauch pro Doppelhub (Volumen Pro/E)\n'[cm^3']]]","v":2.35},6,6,"0,05/0,05",{"$f":"Tabelle1[[#This Row],[Schließ-/\nÖffnungszeit\ngemessen\n'[s']]]","v":"0,05/0,05"},"-40/80",{"$f":"Tabelle1[[#This Row],[NennØ]]","v":20},20.297749999999997,107.24706446201708,27.333333333333332]
["0398921",21,"Schnappscheibe",20.79,{"$f":"E10*Tabelle1[[#This Row],[NennØ]]/B10","v":30.45},"M14x1,5","M5",{"$f":"CONCATENATE(\"LOG \",FIXED(Tabelle1[[#This Row],[NennØ]],1),\"-\",Tabelle1[[#This Row],[A]],\"-\",Tabelle1[[#This Row],[B]])","v":"LOG 21,0-M14x1,5-M5"},"keine Messung","keine Messung",{"$f":"(($K$15-$K$10)/($B$15-$B$10))*Tabelle1[[#This Row],[NennØ]]+$K$15-$B$15*(($K$15-$K$10)/($B$15-$B$10))","v":8.8000000000000023E-3},{"$f":"0.1*Tabelle1[[#This Row],[F(dmin)\nberechnete Greifkraft \n6 bar]]/9.81/2","v":0.55007850202224118},"keine Messung",{"$f":"(($N$15-$N$10)/($B$15-$B$10))*Tabelle1[[#This Row],[NennØ]]+$N$15-$B$15*(($N$15-$N$10)/($B$15-$B$10))","v":2.8400000000000016},6,6,"keine Messung","0,05/0,05","-40/80",{"$f":"Tabelle1[[#This Row],[NennØ]]","v":21},21.411899999999999,107.92540209676372,28.533333333333331]
["0398922",22,"Schnappscheibe",21.78,{"$f":"E11*Tabelle1[[#This Row],[NennØ]]/B11","v":31.9},"M14x1,5","M5",{"$f":"CONCATENATE(\"LOG \",FIXED(Tabelle1[[#This Row],[NennØ]],1),\"-\",Tabelle1[[#This Row],[A]],\"-\",Tabelle1[[#This Row],[B]])","v":"LOG 22,0-M14x1,5-M5"},"keine Messung","keine Messung",{"$f":"(($K$15-$K$10)/($B$15-$B$10))*Tabelle1[[#This Row],[NennØ]]+$K$15-$B$15*(($K$15-$K$10)/($B$15-$B$10))","v":9.6000000000000009E-3},{"$f":"0.1*Tabelle1[[#This Row],[F(dmin)\nberechnete Greifkraft \n6 bar]]/9.81/2","v":0.56400671255443657},"keine Messung",{"$f":"(($N$15-$N$10)/($B$15-$B$10))*Tabelle1[[#This Row],[NennØ]]+$N$15-$B$15*(($N$15-$N$10)/($B$15-$B$10))","v":3.33},6,6,"keine Messung","0,05/0,05","-40/80",{"$f":"Tabelle1[[#This Row],[NennØ]]","v":22},22.526050000000001,110.65811700318045,29.733333333333334]
["0398923",23,"Schnappscheibe",22.77,{"$f":"E12*Tabelle1[[#This Row],[NennØ]]/B12","v":33.349999999999994},"M14x1,5","M5",{"$f":"CONCATENATE(\"LOG \",FIXED(Tabelle1[[#This Row],[NennØ]],1),\"-\",Tabelle1[[#This Row],[A]],\"-\",Tabelle1[[#This Row],[B]])","v":"LOG 23,0-M14x1,5-M5"},"keine Messung","keine Messung",{"$f":"(($K$15-$K$10)/($B$15-$B$10))*Tabelle1[[#This Row],[NennØ]]+$K$15-$B$15*(($K$15-$K$10)/($B$15-$B$10))","v":1.04E-2},{"$f":"0.1*Tabelle1[[#This Row],[F(dmin)\nberechnete Greifkraft \n6 bar]]/9.81/2","v":0.58226869110254353},"keine Messung",{"$f":"(($N$15-$N$10)/($B$15-$B$10))*Tabelle1[[#This Row],[NennØ]]+$N$15-$B$15*(($N$15-$N$10)/($B$15-$B$10))","v":3.8199999999999985},6,6,"keine Messung","0,05/0,05","-40/80",{"$f":"Tabelle1[[#This Row],[NennØ]]","v":23},23.640200000000004,114.24111719431903,30.933333333333334]
["0398924",24,"Schnappscheibe",23.759999999999998,{"$f":"E13*Tabelle1[[#This Row],[NennØ]]/B13","v":34.799999999999997},"M14x1,5","M5",{"$f":"CONCATENATE(\"LOG \",FIXED(Tabelle1[[#This Row],[NennØ]],1),\"-\",Tabelle1[[#This Row],[A]],\"-\",Tabelle1[[#This Row],[B]])","v":"LOG 24,0-M14x1,5-M5"},"keine Messung","keine Messung",{"$f":"(($K$15-$K$10)/($B$15-$B$10))*Tabelle1[[#This Row],[NennØ]]+$K$15-$B$15*(($K$15-$K$10)/($B$15-$B$10))","v":1.1200000000000002E-2},{"$f":"0.1*Tabelle1[[#This Row],[F(dmin)\nberechnete Greifkraft \n6 bar]]/9.81/2","v":0.60273951701197381},"keine Messung",{"$f":"(($N$15-$N$10)/($B$15-$B$10))*Tabelle1[[#This Row],[NennØ]]+$N$15-$B$15*(($N$15-$N$10)/($B$15-$B$10))","v":4.3100000000000005},6,6,"keine Messung","0,05/0,05","-40/80",{"$f":"Tabelle1[[#This Row],[NennØ]]","v":24},24.754350000000002,118.25749323774926,32.13333333333334]
["0398925",25,"Schnappscheibe",24.75,{"$f":"E14*Tabelle1[[#This Row],[NennØ]]/B14","v":36.249999999999993},"M14x1,5","M5",{"$f":"CONCATENATE(\"LOG \",FIXED(Tabelle1[[#This Row],[NennØ]],1),\"-\",Tabelle1[[#This Row],[A]],\"-\",Tabelle1[[#This Row],[B]])","v":"LOG 25,0-M14x1,5-M5"},1.1936234E-2,1.2E-2,{"$f":"Tabelle1[[#This Row],[Eigen-\nmasse\ngemessen\n'[kg']]]","v":1.2E-2},{"$f":"0.1*Tabelle1[[#This Row],[F(dmin)\nberechnete Greifkraft \n6 bar]]/9.81/2","v":0.62448829864123645},4.8,{"$f":"Tabelle1[[#This Row],[Fluidverbrauch pro Doppelhub (Volumen Pro/E)\n'[cm^3']]]","v":4.8},6,6,"0,05/0,05",{"$f":"Tabelle1[[#This Row],[Schließ-/\nÖffnungszeit\ngemessen\n'[s']]]","v":"0,05/0,05"},"-40/80",{"$f":"Tabelle1[[#This Row],[NennØ]]","v":25},25.868500000000001,122.5246041934106,33.333333333333336]
["0398926",26,"Schnappscheibe",25.74,{"$f":"E15*Tabelle1[[#This Row],[NennØ]]/B15","v":37.699999999999989},"M16x1","M5",{"$f":"CONCATENATE(\"LOG \",FIXED(Tabelle1[[#This Row],[NennØ]],1),\"-\",Tabelle1[[#This Row],[A]],\"-\",Tabelle1[[#This Row],[B]])","v":"LOG 26,0-M16x1-M5"},"keine Messung","keine Messung",{"$f":"(($K$20-$K$15)/($B$20-$B$15))*Tabelle1[[#This Row],[NennØ]]+$K$20-$B$20*(($K$20-$K$15)/($B$20-$B$15))","v":1.3600000000000001E-2},{"$f":"0.1*Tabelle1[[#This Row],[F(dmin)\nberechnete Greifkraft \n6 bar]]/9.81/2","v":0.6407564641449055},"keine Messung",{"$f":"(($N$20-$N$15)/($B$20-$B$15))*Tabelle1[[#This Row],[NennØ]]+$N$20-$B$20*(($N$20-$N$15)/($B$20-$B$15))","v":5.5599999999999987},6,6,"keine Messung","0,05/0,05","-40/80",{"$f":"Tabelle1[[#This Row],[NennØ]]","v":26},27.052299999999995,125.71641826523046,34.666666666666671]
["0398927",27,"Schnappscheibe",26.73,{"$f":"E16*Tabelle1[[#This Row],[NennØ]]/B16","v":39.149999999999984},"M16x1","M5",{"$f":"CONCATENATE(\"LOG \",FIXED(Tabelle1[[#This Row],[NennØ]],1),\"-\",Tabelle1[[#This Row],[A]],\"-\",Tabelle1[[#This Row],[B]])","v":"LOG 27,0-M16x1-M5"},"keine Messung","keine Messung",{"$f":"(($K$20-$K$15)/($B$20-$B$15))*Tabelle1[[#This Row],[NennØ]]+$K$20-$B$20*(($K$20-$K$15)/($B$20-$B$15))","v":1.5200000000000005E-2},{"$f":"0.1*Tabelle1[[#This Row],[F(dmin)\nberechnete Greifkraft \n6 bar]]/9.81/2","v":0.65584429029834335},"keine Messung",{"$f":"(($N$20-$N$15)/($B$20-$B$15))*Tabelle1[[#This Row],[NennØ]]+$N$20-$B$20*(($N$20-$N$15)/($B$20-$B$15))","v":6.3199999999999967},6,6,"keine Messung","0,06/0,06","-40/80",{"$f":"Tabelle1[[#This Row],[NennØ]]","v":27},28.2361,128.67664975653497,36.000000000000007]
["0398928",28,"Schnappscheibe",27.72,{"$f":"E17*Tabelle1[[#This Row],[NennØ]]/B17","v":40.599999999999987},"M16x1","M5",{"$f":"CONCATENATE(\"LOG \",FIXED(Tabelle1[[#This Row],[NennØ]],1),\"-\",Tabelle1[[#This Row],[A]],\"-\",Tabelle1[[#This Row],[B]])","v":"LOG 28,0-M16x1-M5"},"keine Messung","keine Messung",{"$f":"(($K$20-$K$15)/($B$20-$B$15))*Tabelle1[[#This Row],[NennØ]]+$K$20-$B$20*(($K$20-$K$15)/($B$20-$B$15))","v":1.6799999999999995E-2},{"$f":"0.1*Tabelle1[[#This Row],[F(dmin)\nberechnete Greifkraft \n6 bar]]/9.81/2","v":0.67019452271374269},"keine Messung",{"$f":"(($N$20-$N$15)/($B$20-$B$15))*Tabelle1[[#This Row],[NennØ]]+$N$20-$B$20*(($N$20-$N$15)/($B$20-$B$15))","v":7.0800000000000018},6,6,"keine Messung","0,06/0,06","-40/80",{"$f":"Tabelle1[[#This Row],[NennØ]]","v":28},29.419900000000002,131.49216535643632,37.333333333333336]
["0398929",29,"Schnappscheibe",28.71,{"$f":"E18*Tabelle1[[#This Row],[NennØ]]/B18","v":42.04999999999999},"M16x1","M5",{"$f":"CONCATENATE(\"LOG \",FIXED(Tabelle1[[#This Row],[NennØ]],1),\"-\",Tabelle1[[#This Row],[A]],\"-\",Tabelle1[[#This Row],[B]])","v":"LOG 29,0-M16x1-M5"},"keine Messung","keine Messung",{"$f":"(($K$20-$K$15)/($B$20-$B$15))*Tabelle1[[#This Row],[NennØ]]+$K$20-$B$20*(($K$20-$K$15)/($B$20-$B$15))","v":1.84E-2},{"$f":"0.1*Tabelle1[[#This Row],[F(dmin)\nberechnete Greifkraft \n6 bar]]/9.81/2","v":0.68405308440667789},"keine Messung",{"$f":"(($N$20-$N$15)/($B$20-$B$15))*Tabelle1[[#This Row],[NennØ]]+$N$20-$B$20*(($N$20-$N$15)/($B$20-$B$15))","v":7.84},6,6,"keine Messung","0,06/0,06","-40/80",{"$f":"Tabelle1[[#This Row],[NennØ]]","v":29},30.603699999999996,134.2112151605902,38.666666666666671]
["0398930",30,"Schnappscheibe",29.7,{"$f":"E19*Tabelle1[[#This Row],[NennØ]]/B19","v":43.499999999999993},"M16x1","M5",{"$f":"CONCATENATE(\"LOG \",FIXED(Tabelle1[[#This Row],[NennØ]],1),\"-\",Tabelle1[[#This Row],[A]],\"-\",Tabelle1[[#This Row],[B]])","v":"LOG 30,0-M16x1-M5"},1.8530765000000001E-2,0.02,{"$f":"Tabelle1[[#This Row],[Eigen-\nmasse\ngemessen\n'[kg']]]","v":0.02},{"$f":"0.1*Tabelle1[[#This Row],[F(dmin)\nberechnete Greifkraft \n6 bar]]/9.81/2","v":0.69756750814494961},8.6,{"$f":"Tabelle1[[#This Row],[Fluidverbrauch pro Doppelhub (Volumen Pro/E)\n'[cm^3']]]","v":8.6},6,6,"keine Messung","0,06/0,06","-40/80",{"$f":"Tabelle1[[#This Row],[NennØ]]","v":30},31.787499999999998,136.86274509803911,40]
["0398931",31,"Schnappscheibe",30.69,{"$f":"E20*Tabelle1[[#This Row],[NennØ]]/B20","v":44.949999999999996},"M16x1","M5",{"$f":"CONCATENATE(\"LOG \",FIXED(Tabelle1[[#This Row],[NennØ]],1),\"-\",Tabelle1[[#This Row],[A]],\"-\",Tabelle1[[#This Row],[B]])","v":"LOG 31,0-M16x1-M5"},"keine Messung","keine Messung",{"$f":"(($K$20-$K$15)/($B$20-$B$15))*Tabelle1[[#This Row],[NennØ]]+$K$20-$B$20*(($K$20-$K$15)/($B$20-$B$15))","v":2.1600000000000008E-2},{"$f":"0.1*Tabelle1[[#This Row],[F(dmin)\nberechnete Greifkraft \n6 bar]]/9.81/2","v":0.71083166798502984},"keine Messung",{"$f":"(($N$20-$N$15)/($B$20-$B$15))*Tabelle1[[#This Row],[NennØ]]+$N$20-$B$20*(($N$20-$N$15)/($B$20-$B$15))","v":9.3599999999999959},6,6,"keine Messung","0,06/0,06","-40/80",{"$f":"Tabelle1[[#This Row],[NennØ]]","v":31},32.971299999999992,139.46517325866284,41.333333333333336]
["0398932",32,"Faltenbalg",{"$f":"0.99*B22","v":31.68},37.6,"M16x1","M5",{"$f":"CONCATENATE(\"LOG \",FIXED(Tabelle1[[#This Row],[NennØ]],1),\"-\",Tabelle1[[#This Row],[A]],\"-\",Tabelle1[[#This Row],[B]])","v":"LOG 32,0-M16x1-M5"},1.8111387E-2,0.02,{"$f":"Tabelle1[[#This Row],[Eigen-\nmasse\ngemessen\n'[kg']]]","v":0.02},{"$f":"0.1*Tabelle1[[#This Row],[F(dmin)\nberechnete Greifkraft \n6 bar]]/9.81/2","v":0.68068829556258803},3.95,{"$f":"Tabelle1[[#This Row],[Fluidverbrauch pro Doppelhub (Volumen Pro/E)\n'[cm^3']]]","v":3.95},6,6,"0,06/0,06",{"$f":"Tabelle1[[#This Row],[Schließ-/\nÖffnungszeit\ngemessen\n'[s']]]","v":"0,06/0,06"},"-40/80",{"$f":"Tabelle1[[#This Row],[NennØ]]","v":32},34.221500000000006,133.55104358937979,20]
["0398933",33,"Faltenbalg",32.67,{"$f":"E22*Tabelle1[[#This Row],[NennØ]]/B22","v":38.774999999999999},"M16x1","M5",{"$f":"CONCATENATE(\"LOG \",FIXED(Tabelle1[[#This Row],[NennØ]],1),\"-\",Tabelle1[[#This Row],[A]],\"-\",Tabelle1[[#This Row],[B]])","v":"LOG 33,0-M16x1-M5"},"keine Messung","keine Messung",{"$f":"(($K$30-$K$22)/($B$30-$B$22))*Tabelle1[[#This Row],[NennØ]]+$K$30-$B$30*(($K$30-$K$22)/($B$30-$B$22))","v":2.1750000000000005E-2},{"$f":"0.1*Tabelle1[[#This Row],[F(dmin)\nberechnete Greifkraft \n6 bar]]/9.81/2","v":0.75395751583327464},"keine Messung",{"$f":"(($N$30-$N$22)/($B$30-$B$22))*Tabelle1[[#This Row],[NennØ]]+$N$30-$B$30*(($N$30-$N$22)/($B$30-$B$22))","v":4.4824999999999982},6,6,"keine Messung","0,06/0,06","-40/80",{"$f":"Tabelle1[[#This Row],[NennØ]]","v":33},35.490125000000006,147.92646460648848,25.833333333333336]
["0398934",34,"Faltenbalg",33.659999999999997,{"$f":"E23*Tabelle1[[#This Row],[NennØ]]/B23","v":39.949999999999996},"M16x1","M5",{"$f":"CONCATENATE(\"LOG \",FIXED(Tabelle1[[#This Row],[NennØ]],1),\"-\",Tabelle1[[#This Row],[A]],\"-\",Tabelle1[[#This Row],[B]])","v":"LOG 34,0-M16x1-M5"},"keine Messung","keine Messung",{"$f":"(($K$30-$K$22)/($B$30-$B$22))*Tabelle1[[#This Row],[NennØ]]+$K$30-$B$30*(($K$30-$K$22)/($B$30-$B$22))","v":2.3500000000000007E-2},{"$f":"0.1*Tabelle1[[#This Row],[F(dmin)\nberechnete Greifkraft \n6 bar]]/9.81/2","v":0.82539924723111557},"keine Messung",{"$f":"(($N$30-$N$22)/($B$30-$B$22))*Tabelle1[[#This Row],[NennØ]]+$N$30-$B$30*(($N$30-$N$22)/($B$30-$B$22))","v":5.0150000000000006},6,6,"keine Messung","0,06/0,06","-40/80",{"$f":"Tabelle1[[#This Row],[NennØ]]","v":34},36.758750000000006,161.94333230674488,31.666666666666668]
["0398935",35,"Faltenbalg",34.65,{"$f":"E24*Tabelle1[[#This Row],[NennØ]]/B24","v":41.124999999999993},"M16x1","M5",{"$f":"CONCATENATE(\"LOG \",FIXED(Tabelle1[[#This Row],[NennØ]],1),\"-\",Tabelle1[[#This Row],[A]],\"-\",Tabelle1[[#This Row],[B]])","v":"LOG 35,0-M16x1-M5"},"keine Messung","keine Messung",{"$f":"(($K$30-$K$22)/($B$30-$B$22))*Tabelle1[[#This Row],[NennØ]]+$K$30-$B$30*(($K$30-$K$22)/($B$30-$B$22))","v":2.5249999999999995E-2},{"$f":"0.1*Tabelle1[[#This Row],[F(dmin)\nberechnete Greifkraft \n6 bar]]/9.81/2","v":0.89535381792166191},"keine Messung",{"$f":"(($N$30-$N$22)/($B$30-$B$22))*Tabelle1[[#This Row],[NennØ]]+$N$30-$B$30*(($N$30-$N$22)/($B$30-$B$22))","v":5.5474999999999994},6,6,"keine Messung","0,07/0,07","-40/80",{"$f":"Tabelle1[[#This Row],[NennØ]]","v":35},38.027375000000006,175.66841907623007,37.5]
["0398936",36,"Faltenbalg",35.64,{"$f":"E25*Tabelle1[[#This Row],[NennØ]]/B25","v":42.29999999999999},"M16x1","M5",{"$f":"CONCATENATE(\"LOG \",FIXED(Tabelle1[[#This Row],[NennØ]],1),\"-\",Tabelle1[[#This Row],[A]],\"-\",Tabelle1[[#This Row],[B]])","v":"LOG 36,0-M16x1-M5"},"keine Messung","keine Messung",{"$f":"(($K$30-$K$22)/($B$30-$B$22))*Tabelle1[[#This Row],[NennØ]]+$K$30-$B$30*(($K$30-$K$22)/($B$30-$B$22))","v":2.700000000000001E-2},{"$f":"0.1*Tabelle1[[#This Row],[F(dmin)\nberechnete Greifkraft \n6 bar]]/9.81/2","v":0.96408199066274336},"keine Messung",{"$f":"(($N$30-$N$22)/($B$30-$B$22))*Tabelle1[[#This Row],[NennØ]]+$N$30-$B$30*(($N$30-$N$22)/($B$30-$B$22))","v":6.0799999999999983},6,6,"keine Messung","0,07/0,07","-40/80",{"$f":"Tabelle1[[#This Row],[NennØ]]","v":36},39.296000000000006,189.15288656803023,43.333333333333336]
["0398937",37,"Faltenbalg",36.630000000000003,{"$f":"E26*Tabelle1[[#This Row],[NennØ]]/B26","v":43.474999999999994},"M16x1","M5",{"$f":"CONCATENATE(\"LOG \",FIXED(Tabelle1[[#This Row],[NennØ]],1),\"-\",Tabelle1[[#This Row],[A]],\"-\",Tabelle1[[#This Row],[B]])","v":"LOG 37,0-M16x1-M5"},"keine Messung","keine Messung",{"$f":"(($K$30-$K$22)/($B$30-$B$22))*Tabelle1[[#This Row],[NennØ]]+$K$30-$B$30*(($K$30-$K$22)/($B$30-$B$22))","v":2.8750000000000012E-2},{"$f":"0.1*Tabelle1[[#This Row],[F(dmin)\nberechnete Greifkraft \n6 bar]]/9.81/2","v":1.0317869308468703},"keine Messung",{"$f":"(($N$30-$N$22)/($B$30-$B$22))*Tabelle1[[#This Row],[NennØ]]+$N$30-$B$30*(($N$30-$N$22)/($B$30-$B$22))","v":6.6125000000000007},6,6,"keine Messung","0,07/0,07","-40/80",{"$f":"Tabelle1[[#This Row],[NennØ]]","v":37},40.564624999999999,202.43659583215594,49.166666666666671]
["0398938",38,"Faltenbalg",37.619999999999997,{"$f":"E27*Tabelle1[[#This Row],[NennØ]]/B27","v":44.649999999999991},"M16x1","M5",{"$f":"CONCATENATE(\"LOG \",FIXED(Tabelle1[[#This Row],[NennØ]],1),\"-\",Tabelle1[[#This Row],[A]],\"-\",Tabelle1[[#This Row],[B]])","v":"LOG 38,0-M16x1-M5"},"keine Messung","keine Messung",{"$f":"(($K$30-$K$22)/($B$30-$B$22))*Tabelle1[[#This Row],[NennØ]]+$K$30-$B$30*(($K$30-$K$22)/($B$30-$B$22))","v":3.0499999999999999E-2},{"$f":"0.1*Tabelle1[[#This Row],[F(dmin)\nberechnete Greifkraft \n6 bar]]/9.81/2","v":1.0986292769656054},"keine Messung",{"$f":"(($N$30-$N$22)/($B$30-$B$22))*Tabelle1[[#This Row],[NennØ]]+$N$30-$B$30*(($N$30-$N$22)/($B$30-$B$22))","v":7.1449999999999996},6,6,"keine Messung","0,08/0,08","-40/80",{"$f":"Tabelle1[[#This Row],[NennØ]]","v":38},41.83325,215.55106414065176,55]
["0398939",39,"Faltenbalg",38.61,{"$f":"E28*Tabelle1[[#This Row],[NennØ]]/B28","v":45.824999999999989},"M16x1","M5",{"$f":"CONCATENATE(\"LOG \",FIXED(Tabelle1[[#This Row],[NennØ]],1),\"-\",Tabelle1[[#This Row],[A]],\"-\",Tabelle1[[#This Row],[B]])","v":"LOG 39,0-M16x1-M5"},"keine Messung","keine Messung",{"$f":"(($K$30-$K$22)/($B$30-$B$22))*Tabelle1[[#This Row],[NennØ]]+$K$30-$B$30*(($K$30-$K$22)/($B$30-$B$22))","v":3.2250000000000001E-2},{"$f":"0.1*Tabelle1[[#This Row],[F(dmin)\nberechnete Greifkraft \n6 bar]]/9.81/2","v":1.1647377145202724},"keine Messung",{"$f":"(($N$30-$N$22)/($B$30-$B$22))*Tabelle1[[#This Row],[NennØ]]+$N$30-$B$30*(($N$30-$N$22)/($B$30-$B$22))","v":7.6774999999999984},6,6,"keine Messung","0,08/0,08","-40/80",{"$f":"Tabelle1[[#This Row],[NennØ]]","v":39},43.101875,228.52153958887743,60.833333333333336]
["0398940",40,"Faltenbalg",39.6,{"$f":"E29*Tabelle1[[#This Row],[NennØ]]/B29","v":46.999999999999986},"M16x1","M5",{"$f":"CONCATENATE(\"LOG \",FIXED(Tabelle1[[#This Row],[NennØ]],1),\"-\",Tabelle1[[#This Row],[A]],\"-\",Tabelle1[[#This Row],[B]])","v":"LOG 40,0-M16x1-M5"},3.1305567999999999E-2,3.4000000000000002E-2,{"$f":"Tabelle1[[#This Row],[Eigen-\nmasse\ngemessen\n'[kg']]]","v":3.4000000000000002E-2},{"$f":"0.1*Tabelle1[[#This Row],[F(dmin)\nberechnete Greifkraft \n6 bar]]/9.81/2","v":1.2302165444656492},8.2100000000000009,{"$f":"Tabelle1[[#This Row],[Fluidverbrauch pro Doppelhub (Volumen Pro/E)\n'[cm^3']]]","v":8.2100000000000009},6,6,"0,08/0,08",{"$f":"Tabelle1[[#This Row],[Schließ-/\nÖffnungszeit\ngemessen\n'[s']]]","v":"0,08/0,08"},"-40/80",{"$f":"Tabelle1[[#This Row],[NennØ]]","v":40},44.3705,241.36848602416035,66.666666666666671]
{"$rows_left_out":157}